Jump to content
  • 0
peppergomez

wxPython: stdout/stderr message

Question

I clicked the Installers tab in Wrye Bash and got this message while it was loading:

 

 

 

Traceback (most recent call last):  File "bashbasher.pyo", line 5159, in OnShowPage  File "bashbasher.pyo", line 3821, in OnShow  File "bashbosh.pyo", line 9128, in refresh  File "bashbosh.pyo", line 7422, in refreshSizeCrcDate  File "bashbolt.pyo", line 1191, in size  File "genericpath.pyo", line 49, in getsizeWindowsError: [Error 3] The system cannot find the path specified: u'F:Steam LibrarySteamAppscommonSkyrimDataSoundVoiceSkyrim.esmfemaleargonianvoicepowers_shout01b_000683b1_1.fuz' 

 

I have finished a STEP Extended install and am about to build my bashed patch.

Share this post


Link to post
Share on other sites

12 answers to this question

Recommended Posts

  • 0

Yeah, I'v been getting something similar as well after installing STEP Extended Patch, pops up every time I go to build a Bash Patch, I'm currently just ignoring it... and hoping nothing will go wrong.

Traceback (most recent call last):
  File "bash\basher.pyo", line 5524, in RefreshData
  File "bash\bosh.pyo", line 4335, in refresh
  File "bash\bosh.pyo", line 4586, in reloadBashTags
  File "bash\bosh.pyo", line 3664, in reloadBashTags
  File "bash\bosh.pyo", line 5615, in getBashTags
  File "bash\loot.pyo", line 373, in GetModBashTags
  File "bash\loot.pyo", line 240, in LootErrorCheck
bash.loot.LootError: LootError: loot_error_no_tag_map:No Bash Tag map has been previously generated.
Edited by Carnage2k4

Share this post


Link to post
Share on other sites
  • 0

This looks more like it has to do with the installed files. The loot API seems to want the bash tag file which should be taglist.yaml. So although I am not sure what is causing the error and I have limited knowledge of Python, that is where I would be looking. I really recommend for most people to use 305 of Wrye Bash for Skyrim. I also recommend that you use the EXE installer so you don't miss installing any files. TES5Edit users have been experiencing odd issues with some virus programs, especially Kaspersky Antivirus. So for testing run things with your virus software disabled, and run programs as Admin.

Another user had an error with the bash tag map.

Edited by Sharlikran

Share this post


Link to post
Share on other sites
  • 0

Py errors via WB are most often caused by lack of proper Windows registry entries for Skyrim (LOOT requires, and WB may or may not). Try launching Skyrim via the Steam launcher ... no necessary to "play game" ... just run the launcher directly from Steam (not SKSE or via MO) once and let it set reg entries and produce the INIs in the default location.

 

see if that resolves.

 

EDIT: Carnage's error above is different and discussed in adjacent forum.

Share this post


Link to post
Share on other sites
  • 0

I think, that i have a similar problem. When i try to create a bashed patch i always get this error :wxPython: stdout/stderr

Traceback (most recent call last):
  File "bash\basher.pyo", line 7045, in Execute
  File "bash\bosh.pyo", line 10622, in buildPatch
  File "bash\bosh.pyo", line 18687, in buildPatch
  File "bash\bosh.pyo", line 18186, in buildPatch
AttributeError: 'NoneType' object has no attribute 'lower'

Share this post


Link to post
Share on other sites
  • 0

I'm suddenly having issues with WB not running as well.  I've never had an issue with it before but today it suddenly started saying:

 

Error! Unable to start Wrye Bash.
 
Please ensure Wrye Bash is correctly installed.
 
 
Traceback (most recent call last):
  File "bash\bash.pyo", line 457, in main
  File "bash\bosh.pyo", line 24587, in initBosh
  File "bash\bosh.pyo", line 24359, in initDirs
  File "bash\bosh.pyo", line 5570, in __init__
  File "bash\bosh.pyo", line 5591, in refresh
  File "bash\loot.pyo", line 344, in Load
WindowsError: [Error -529697949] Windows Error 0xE06D7363
 
 
I've reinstalled it, tried as admin, turned off the antivirus, reinstalled C++ 2010 ( the one in the Skyrim directory )...  I'm at a loss as to what it could be and why it just suddenly started acting this way.  I'm using 305.
 
If anyone has a suggestion I'd appreciate it.  Thanks.

Share this post


Link to post
Share on other sites
  • 0

After taking a break from Skyrim for a bit I am suddenly having this problem also. I have run Wrye Bash within MO many times without a problem in the past. MO version is 1.2.18, Wrye Bash version is 305. I tried re-installing Wrye Bash ... problem persists. I also ensured that the Wrye Bash executable could run as administrator. 

 

Does anyone have an idea?

Share this post


Link to post
Share on other sites
  • 0

Try completely uninstalling and reinstalling.

I tried your suggestion but I get the same failure. The only thing I can think of is to reinstall Skyrim from scratch.

Share this post


Link to post
Share on other sites
  • 0

Reinstalling Skyrim didn't work for me.  I ended up having to drop down to 304 and haven't had a problem since.

Yes ... totally rebuilding the Skyrim install did not resolve the issue. However installing version 304 made the problem go away.

 

Thank for this solution...much appreciated.

Share this post


Link to post
Share on other sites

Create an account or sign in to comment

You need to be a member in order to leave a comment

Create an account

Sign up for a new account in our community. It's easy!

Register a new account

Sign in

Already have an account? Sign in here.

Sign In Now

×
×
  • Create New...

Important Information

By using this site, you agree to our Terms of Use.